[tex-k] [tlbuild] 2010 builds

Jukka Salmi j+tex-live at 2010.salmi.ch
Tue May 25 11:16:26 CEST 2010

Karl Berry --> tlbuild (2010-02-22 01:46:53 +0000):
> I hope that we will start doing builds for TL 2010 earlier than last
> year.  And finish earlier, too.  To that end, could those of you who
> have not done builds since the 2009 release give the current sources a
> try, and report any problems on your respective platforms?
> The main changes at this point are in the build system (thanks to peb),
> and it would be nice to work on those problems before updating the
> engines, etc.

Building on NetBSD/i386 fails in chktex:

Making check in chktex
gmake[3]: Entering directory `/a/src/texlive/Build/source/Work/utils/chktex'
gmake  check-TESTS
gmake[4]: Entering directory `/a/src/texlive/Build/source/Work/utils/chktex'
ChkTeX v1.6.4 - Copyright 1995-96 Jens T. Berger Thielemann.

No errors printed; No warnings printed; No user suppressed warnings printed.
< Message 19 in Test.tex: Use "'" (ASCII 39) instead  of "´" (ASCII 180).
< Is this an "example", or is it an ´example´.  
<                                   ^
< Message 19 in Test.tex: Use "'" (ASCII 39) instead  of "´" (ASCII 180).
> Message 26 in Test.tex: You ought to remove spaces in front of punctuation.
FAIL: chktex.test
1 of 1 test failed
Please report to tex-k at tug.org
gmake[4]: *** [check-TESTS] Error 1
gmake[4]: Leaving directory `/a/src/texlive/Build/source/Work/utils/chktex'
gmake[3]: *** [check-am] Error 2
gmake[3]: Leaving directory `/a/src/texlive/Build/source/Work/utils/chktex'
gmake[2]: *** [check-recursive] Error 1
gmake[2]: Leaving directory `/a/src/texlive/Build/source/Work/utils'
gmake[1]: *** [check-recursive] Error 1
gmake[1]: Leaving directory `/a/src/texlive/Build/source/Work'
gmake: *** [world] Error 2

Regards, Jukka

This email fills a much-needed gap in the archives.

More information about the tex-k mailing list